رفع ارور و مشکلات اندروید استودیو

لرن سایت,آموزش برنامه نویسی سی شارپ,آموزش طراحی سایت,آموزش برنامه نویسی اندروید,آموزش SQL c# android php jquery,قالب سایت

شما اینجا هستید : صفحه اصلی

با عضویت در کانال تلگرامی لرن سایت ، اولین فردی باشید که از تخفیفات و مطالب جدید خبردار می شوید !

رفع ارور و مشکلات اندروید استودیو

رفع ارور و مشکلات اندروید استودیو

با سلام خدمت شما دوستان عزیز و همراهان لرن سایت.

همانطور که می دانید برای برنامه نویسی اندروید ( بصورت استاندارد ) اندروید استودیو نیاز است و این نرم افزار توسط شرکت گوگل ارائه شده است و مختص این کار می باشد هرچند که نرم افزار های مشابه ای مانند اکلیپس وجوددارد اما چنین نرم افزار هایی زیاد به رسمیت شناخته نمی شوند …

اندروید استودیو مزایا و معایبی دارد ، از مزایا آن می شود به امکانات بالا و نیز پشتیبانی رسمی گوگل از این نرم افزار را اشاره کرد ، معایبی که اندروید استودیو دارد این است که نصب و راهندازی ان کمی دشوار است و امکان دارد در برخی از موارد کلا برنامه نویس قید ان را بزند …

از مبحث اصلی دور نشویم.. همانطور که در بالا نیز اشاره شد ، نصب و راهندازی اندروید استودیو در برخی از موارد بسیار دشوار است به همین دلیل در این پست تصمیم گرفتم تا جایی که میدونم و در توانم هست ارور ها و مشکلات اندروید استودیو را قرار بدم و راه حل هاش را برای شما دوستان عزیز بنویسم.

این پست ، جامع هست و ارور موردنظرتان را میتوانید در این صفحه سرچ کنید ، در صورتیکه ارور و راه حل رفع ان را پیدا نکردید می توانید ارور و مشکل خود را در قسمت نظرات درج نمایید تا در صورت امکان راه حلی برای رفع ارور در اختیار شما قرار داده شود.

در اخر نیز قابل ذکر است تمامی راه حل ها تست شده و بدون مشکل هستند.

ارور :

Unable to create Debug Bridge: Unable to start adb server: error: cannot open ‘C:\Users\User\AppData\Local\Temp\adb.log’: Permission denied
could not read ok from ADB Server
* failed to start daemon *
error: cannot connect to daemon
‘C:\Users\User\AppData\Local\Android\Sdk\platform-tools\adb.exe,start-server’ failed — run manually if necessary

راه حل : ابتدا طبق اموزش “رفع مشکل adb اکلیپس” اقدام کنید سپس اندروید استودیو را با ادمین سیستم (Run As Administrator ) باز کنید.

—————–

ارور :

Cannot launch AVD in emulator.
Output:
This application has requested the Runtime to terminate it in an unusual way.
Please contact the application’s support team for more information.
emulator: ERROR: Failed to create temp directory for crash service communication: ‘C:\Users\SHARIF~1\AppData\Local\Temp\\AndroidEmulator\539927d5-339d-11e6-b22a-b05adacbaeac’
terminate called after throwing an instance of ‘std::logic_error’
emulator: WARNING: Failed to open a temp file ‘C:\Users\SHARIF~1\AppData\Local\Temp\\AndroidEmulator\539927d5-339d-11e6-b22a-b05adacbaeac\command-line-and-environment.txt’ for writing
what(): basic_string::_S_construct null not valid
emulator: WARNING: VM heap size set below hardware specified minimum of 128MB
emulator: WARNING: Setting VM heap size to 384MB

 

راه حل : اندروید استودیو را توسط ادمین سیستم ( Run As Administrator ) ران کنید.

—————

ارور : Gradle project sync failed. Please fix your project and try again

راه حل :

—————-

ارور :  cannot resolve symbol R

راه حل : Gradle را یک بار Sync کنید ( توسط آیکون منو بالا یا Tools -> Android -> Sync Project With Gradle Files ) و در صورتیکه در اجرای Gradle مشکلی داشتید در نظرات ارسال کنید تا راهنمایی کنیم.

————–

ارور : در صورتیکه کتابخانه های گوگل به SDK ناقص اضافه شدند توسط راه حل زیر ان ها را اضافه نمایید

راه حل : ابتدا وارد SDK Manger شوید ( توسط محل نصب SDK یا بر روی آیکون رفع مشکلات و ارور های اندروید استودیو در منوی بالا اندروید استودیو کلیک کنید و سپس بر روی لینک Lunch Standalone SDK Manger کلیک کنید ) ، ابتدا چک کنید در صورتیکه کتابخانه های موردنظر در لیست موجود بود و دانلود نشده است دانلود نمایید در غیر اینصورت اگر کلا کتابخانه ها در لیست موجود نبود اینکار را انجام دهید :

ابتدا در SDK Manger به این مکان بروید : Tools -> Options سپس در قسمت Other ، تیک گزینه Force https:// …. Sources to be fetched Using http://… را بزنید.

سپس Close را بزنید و منتظر باشید کتابخانه ها لود شود و سپس ان ها را دانلود و نصب نمایید.

توجه کنید : به علت وجود تحریم های گوگل ، می بایست با ای پی خارجی اقدام به نصب و لود کتابخانه ها نمایید.

—————

در صورت دریافت ارور های ناشناس و…. ، و در صورتیکه برنامه را Run As Administrator  نکرده اید ، برنامه را Run As Administrator کنید ، 90 درصد مشکلات حل خواهد شد.

—————-

** اگر شما در نصب اندروید استودیو مشکلی دارید ، می توانید آموزش نصب اندروید استودیو را از لینک زیر دانلود کنید ، در فیلم آموزشی بطور کامل توضیح داده شده است :

آموزش نصب اندروید استودیو

 

این پست مرجع می باشد و در اینده اگر اروری اضافه شود در این پست افزوده خواهد شد و همچنین اگر پاسخ خود را در این پست پیدا نکردید لطفا سری هم به نظرات بزنید شاید مشکل مشابه شما را کاربران تجربه کرده باشند.

 

ما را از نظرات خود با خبر سازید.

 

در صورتیکه پست به شما مفید واقع شد لطفا آن را توسط دکمه های پایین مطلب به اشتراک بگذارید.

اگه مطلب خوشتون اومد پس لطفا به اشتراک بذارین تا بقیه هم خوششون بیاد :)
  • 11
    Shares

نظرات

مشترک شدن
اطلاع رسانی از :
guest
71 Comments
Inline Feedbacks
View all comments
mahdi
mahdi
1 ماه گذشته

ازتون خواهش مکنم جواب بدین من چند هفته درگیر این نصب این هستم اول نمیتونستم sdk رو به اندروید استدیو مکانشو بگم اومدم هام android sdk و ndk رو نصب کردم ولی وقتی مکان sdk رو میدم ارور میده ولی وقتی مکان ndk رو میدم قبول میکنم اخه اگه از اول باید مکان ndk رو میدادم میگفتین ولی من به همین هم شک دارم چون هیچی نداره حتی به ای پی غیر ایرانی وصل شدم اصلا هیچی برای نصب نیست اگر باید کار دیگه بکنم بگین ممنون میشم

mahdi
mahdi
2 ماه گذشته

سلام ببخشید من وقتی میخام به اندروید استودیو محل sdk رو میگم میاد میگهandroid sdk location should not contain whitespace as this can cause problems with the ndk tools لطفا کمک کنین ممنون میشم

vahid das
vahid das
4 ماه گذشته

سلام وقت بخیر
از اندروید استدیو خخروجی apk نمیتونم بگیرم
پروژه اندروید رو باز میکنم ولی گزینه ای
build apks درbuild نیست
اندروید من نسخه ۳٫۶٫۳ ۳۲ بیت قابل حمل هست
لطفا راهنمای کنید

mostafa
4 ماه گذشته

E/ egl Codec Common: Goldfish Address Space Host Memory Allocator: ioctl_ping failed for device_type=5, ret=-1
سلام موقع استارت کردن این ارور میده

سعید
سعید
5 ماه گذشته

سلام خدمت شما من اندروید استودید رو دانلود و نصب کردم همه چیزهایی که لازم بود رو نصب کردم وقتی یک پروژه جدید باز میکنم و میزنم فایل apk تولید کنه ارور پایین رو میده لطفا راهنمایی کنین ممنون Executing tasks: [:app:assembleRelease] in project C:\Users\saeed\AndroidStudioProjects\MyApplication21 FAILURE: Build failed with an exception. * What went wrong: Could not determine the dependencies of task ‘:app:lintVitalRelease’. > Could not resolve all task dependencies for configuration ‘:app:lintClassPath’. > Could not resolve com.android.tools.lint:lint-gradle:26.6.1. Required by: project :app > No cached version of com.android.tools.lint:lint-gradle:26.6.1 available for offline mode. > No cached version of com.android.tools.lint:lint-gradle:26.6.1 available for… بیشتر بخوانید >

Alfa
Alfa
6 ماه گذشته

مشکل من no process runing موقع استفاده از فیلتر شکنه چیکار کنم ؟!

موقع run این ادرس هارو میده
موقع run این ادرس هارو میده
8 ماه گذشته

org.gradle.api.tasks.TaskExecutionException: Execution failed for task ‘:app:mergeExtDexDebug’. at org.gradle.api.internal.tasks.execution.CatchExceptionTaskExecuter.execute(CatchExceptionTaskExecuter.java:38) at org.gradle.api.internal.tasks.execution.EventFiringTaskExecuter$1.executeTask(EventFiringTaskExecuter.java:73) at org.gradle.api.internal.tasks.execution.EventFiringTaskExecuter$1.call(EventFiringTaskExecuter.java:52) at org.gradle.api.internal.tasks.execution.EventFiringTaskExecuter$1.call(EventFiringTaskExecuter.java:49) at org.gradle.internal.operations.DefaultBuildOperationExecutor$CallableBuildOperationWorker.execute(DefaultBuildOperationExecutor.java:416) at org.gradle.internal.operations.DefaultBuildOperationExecutor$CallableBuildOperationWorker.execute(DefaultBuildOperationExecutor.java:406) at org.gradle.internal.operations.DefaultBuildOperationExecutor$1.execute(DefaultBuildOperationExecutor.java:165) at org.gradle.internal.operations.DefaultBuildOperationExecutor.execute(DefaultBuildOperationExecutor.java:250) at org.gradle.internal.operations.DefaultBuildOperationExecutor.execute(DefaultBuildOperationExecutor.java:158) at org.gradle.internal.operations.DefaultBuildOperationExecutor.call(DefaultBuildOperationExecutor.java:102) at org.gradle.internal.operations.DelegatingBuildOperationExecutor.call(DelegatingBuildOperationExecutor.java:36) at org.gradle.api.internal.tasks.execution.EventFiringTaskExecuter.execute(EventFiringTaskExecuter.java:49) at org.gradle.execution.plan.LocalTaskNodeExecutor.execute(LocalTaskNodeExecutor.java:43) at org.gradle.execution.taskgraph.DefaultTaskExecutionGraph$InvokeNodeExecutorsAction.execute(DefaultTaskExecutionGraph.java:355) at org.gradle.execution.taskgraph.DefaultTaskExecutionGraph$InvokeNodeExecutorsAction.execute(DefaultTaskExecutionGraph.java:343) at org.gradle.execution.taskgraph.DefaultTaskExecutionGraph$BuildOperationAwareExecutionAction.execute(DefaultTaskExecutionGraph.java:336) at org.gradle.execution.taskgraph.DefaultTaskExecutionGraph$BuildOperationAwareExecutionAction.execute(DefaultTaskExecutionGraph.java:322) at org.gradle.execution.plan.DefaultPlanExecutor$ExecutorWorker$1.execute(DefaultPlanExecutor.java:134) at org.gradle.execution.plan.DefaultPlanExecutor$ExecutorWorker$1.execute(DefaultPlanExecutor.java:129) at org.gradle.execution.plan.DefaultPlanExecutor$ExecutorWorker.execute(DefaultPlanExecutor.java:202) at org.gradle.execution.plan.DefaultPlanExecutor$ExecutorWorker.executeNextNode(DefaultPlanExecutor.java:193) at org.gradle.execution.plan.DefaultPlanExecutor$ExecutorWorker.run(DefaultPlanExecutor.java:129) at org.gradle.execution.plan.DefaultPlanExecutor.process(DefaultPlanExecutor.java:74) at org.gradle.execution.taskgraph.DefaultTaskExecutionGraph.executeWithServices(DefaultTaskExecutionGraph.java:178) at org.gradle.execution.taskgraph.DefaultTaskExecutionGraph.execute(DefaultTaskExecutionGraph.java:154) at org.gradle.execution.SelectedTaskExecutionAction.execute(SelectedTaskExecutionAction.java:41) at org.gradle.execution.DefaultBuildExecuter.execute(DefaultBuildExecuter.java:40) at org.gradle.execution.DefaultBuildExecuter.access$000(DefaultBuildExecuter.java:24) at org.gradle.execution.DefaultBuildExecuter$1.proceed(DefaultBuildExecuter.java:46) at org.gradle.execution.DryRunBuildExecutionAction.execute(DryRunBuildExecutionAction.java:49) at org.gradle.execution.DefaultBuildExecuter.execute(DefaultBuildExecuter.java:40) at org.gradle.execution.DefaultBuildExecuter.execute(DefaultBuildExecuter.java:33) at org.gradle.initialization.DefaultGradleLauncher$ExecuteTasks.run(DefaultGradleLauncher.java:383) at org.gradle.internal.operations.DefaultBuildOperationExecutor$RunnableBuildOperationWorker.execute(DefaultBuildOperationExecutor.java:402) at org.gradle.internal.operations.DefaultBuildOperationExecutor$RunnableBuildOperationWorker.execute(DefaultBuildOperationExecutor.java:394) at org.gradle.internal.operations.DefaultBuildOperationExecutor$1.execute(DefaultBuildOperationExecutor.java:165) at org.gradle.internal.operations.DefaultBuildOperationExecutor.execute(DefaultBuildOperationExecutor.java:250) at org.gradle.internal.operations.DefaultBuildOperationExecutor.execute(DefaultBuildOperationExecutor.java:158) at org.gradle.internal.operations.DefaultBuildOperationExecutor.run(DefaultBuildOperationExecutor.java:92) at org.gradle.internal.operations.DelegatingBuildOperationExecutor.run(DelegatingBuildOperationExecutor.java:31) at org.gradle.initialization.DefaultGradleLauncher.runTasks(DefaultGradleLauncher.java:247) at org.gradle.initialization.DefaultGradleLauncher.doBuildStages(DefaultGradleLauncher.java:159) at org.gradle.initialization.DefaultGradleLauncher.executeTasks(DefaultGradleLauncher.java:134) at org.gradle.internal.invocation.GradleBuildController$1.execute(GradleBuildController.java:58) at org.gradle.internal.invocation.GradleBuildController$1.execute(GradleBuildController.java:55) at org.gradle.internal.invocation.GradleBuildController$3.create(GradleBuildController.java:82) at org.gradle.internal.invocation.GradleBuildController$3.create(GradleBuildController.java:75)… بیشتر بخوانید >

javadirani
8 ماه گذشته

InvalidVirtualFileAccessException مشکل من اینه راهنمایی لطفا

جعفری
جعفری
10 ماه گذشته

سلام علیکم
هنگام اجرای برنامه خطای ‘

‘unsuported type ‘string
مشاهده میشه

مرتضی
مرتضی
1 سال گذشته

سلام
من یک اپ طراحی کرده ام با ورژن minSdkVersion 15 – compileSdkVersion 28- targetSdkVersion 28 تو گوشیم کار میکرد البته اینو بگم ورژن گوشیم 8 بود همینطور شبیه ساز هم روزی 23 کار میکردن الان که گوشی آپدیت کردم ورژن گوشی شده 9 باز نمیکنه فقط تو صفحه لود میمونه برام هیچ خطایی نمیده میتونید راهنمایم کنید.
خیلی ممنون

حسین
حسین
1 سال گذشته

سلام
این اندروید استودیو منو کشت نمیدونم چرا مثل ویژوال استودیو نصبش آسون نیست بهم در avd این ارور رو میده هرکاری کردم دیگه درست نشدم پاک دیوانم کرده چه راه راحلی دارید؟
unable to connect to adb. check the event log for possible issues. verify that your localhost entery is pointing to 127.0.0.1 or:1 for IPv4 or Ipv6, respectively

سینا
سینا
Reply to  حسین
1 سال گذشته

cmd رو باز کن دستور adb kill-server رو تایپ کن بعدش ویندوز رو ریستارت کن وقتی سیستم بالا اومد cmd رو باز کن و دستور adb start-server رو تایپ کن

nima
nima
1 سال گذشته

سلام خسته نباشید ی ارور موقع اجرا برنامه تو اندروید استودیو به من میده میخواستم ببینم مشکل از چیه ارورش اینه :
Could not find com.android.tools.build:aapt2:3.4.1-5326820.
Searched in the following locations:
https://dl.google.com/dl/android/maven2/com/android/tools/build/aapt2/3.4.1-5326820/aapt2-3.4.1-5326820.pom
https://dl.google.com/dl/android/maven2/com/android/tools/build/aapt2/3.4.1-5326820/aapt2-3.4.1-5326820-windows.jar
https://jcenter.bintray.com/com/android/tools/build/aapt2/3.4.1-5326820/aapt2-3.4.1-5326820.pom
https://jcenter.bintray.com/com/android/tools/build/aapt2/3.4.1-5326820/aapt2-3.4.1-5326820-windows.jar
Required by:
project :app
oلطف کنین راهنماییم کنین در جهت خل این مشکل ممنون
از اخرین نسخه اندروید استودیو استفاده می کنم و اس دی کام هم نسخه 25 هست

madeh
madeh
1 سال گذشته

سلام و خسته نباشد
برنامه اندروید استودیو من هر بار که باز میشه با مشکل gradle باز میشه و صفحه گرافیک لود نمیشه و پیغام زیر رو نشون میده
design editor is unavilable until after a successful project sync
و هم چنین
gradle project sync faild رو نشان میده
لطفا راهنمایی کنید.

hamed
hamed
Reply to  madeh
1 سال گذشته

مشکل منم همینه.

ارمین
ارمین
1 سال گذشته

سلام من چند روزه درگیر یه ارور هستم وممنون میشم راهنمایی کنین …. اگر امکانش بود پاسخ به ایمیلم بفرستین… E/AndroidRuntime: FATAL EXCEPTION: main java.lang.RuntimeException: Unable to start activity ComponentInfo{af.company.gazebo/af.company.gazebo.Home.HomeActivity}: android.view.InflateException: Binary XML file line #2: Error inflating class android.support.design.widget.CoordinatorLayout at android.app.ActivityThread.performLaunchActivity(ActivityThread.java:2180) at android.app.ActivityThread.handleLaunchActivity(ActivityThread.java:2230) at android.app.ActivityThread.access$600(ActivityThread.java:141) at android.app.ActivityThread$H.handleMessage(ActivityThread.java:1234) at android.os.Handler.dispatchMessage(Handler.java:99) at android.os.Looper.loop(Looper.java:137) at android.app.ActivityThread.main(ActivityThread.java:5041) at java.lang.reflect.Method.invokeNative(Native Method) at java.lang.reflect.Method.invoke(Method.java:511) at com.android.internal.os.ZygoteInit$MethodAndArgsCaller.run(ZygoteInit.java:793) at com.android.internal.os.ZygoteInit.main(ZygoteInit.java:560) at dalvik.system.NativeStart.main(Native Method) Caused by: android.view.InflateException: Binary XML file line #2: Error inflating class android.support.design.widget.CoordinatorLayout at android.view.LayoutInflater.createViewFromTag(LayoutInflater.java:698) at android.view.LayoutInflater.inflate(LayoutInflater.java:466) at android.view.LayoutInflater.inflate(LayoutInflater.java:396) at android.view.LayoutInflater.inflate(LayoutInflater.java:352) at androidx.appcompat.app.AppCompatDelegateImpl.setContentView(AppCompatDelegateImpl.java:469) at androidx.appcompat.app.AppCompatActivity.setContentView(AppCompatActivity.java:140) at af.company.gazebo.Home.HomeActivity.onCreate(HomeActivity.java:40) at android.app.Activity.performCreate(Activity.java:5104) at android.app.Instrumentation.callActivityOnCreate(Instrumentation.java:1080) at android.app.ActivityThread.performLaunchActivity(ActivityThread.java:2144) at android.app.ActivityThread.handleLaunchActivity(ActivityThread.java:2230) … بیشتر بخوانید >

ارین
Reply to  ارمین
1 سال گذشته

منم مشکلم اینه

سینا
سینا
Reply to  ارمین
1 سال گذشته

سلام منم همین ارور رو در استفاده از PersianDatePicker دارم
NullPointerExceptions میده بهم …اگر شما مشکل رو حل کردید به من هم کمک کنید ممنون

محمد
محمد
1 سال گذشته

سلام. سیستم من قابلیت مجازی cpu vt-x رو پشتیبانی میکنه و از طریق بایاس فعالش کردم و چند بار هم چک کردم فعال هست حتی با نرم افزار LeoMoon CPU-V هم از توی خود ویندوز چک کردم میگه هم پشتیبانی میکنه و هم فعاله ولی توی اندروید استادیو وقتی دیوایس رو نصب میکنم و میخوام اجرا کنم ارور میده میگه این قابلیت فعال نیست و باید فعالش کنی(عکس ارور لینک پایین) http://s5.picofile.com/file/8364170842/ErrorAndroidStudio.jpg و اینکه من genymotion رو با virtual box نصب کردم بصورت جداگونه درست اجرا میشه و دیوایس رو اجرا میکنه ولی توی android studio رفتم پلاگینش رو نصب… بیشتر بخوانید >